  Event Time ,ClubID ,EmpFirstName ,EmpLastName ,Enrollment ,MonthlyDues ,PTSessions ,PTRate ,PTPrice ,FirstName ,LastName ,PhoneHome ,Email ,Date ,Gender ,Height ,Weight ,Age ,HealthAge ,BMI ,BodyFat ,Goal1 ->Objective1 ->Frame1 ,Goal2 ->Objective2 ->Frame2 ,Goal3 ->Objective3 ->Frame3 ,Goal4 ->Objective4 ->Frame4 ,Goal5 ->Objective5 ->Frame5 ,Goal6 ->Objective6 ->Frame6 ,Goal7 ->Objective7 ->Frame7 ,Goal8 ->Objective8 ->Frame8 ,Goal9 ->Objective9 ->Frame9 ,
2019-04-05 13:05:03,1,Joseph,Kimball,,,,0,0,JESSICA,TANNURA,(732) 609-0102,jemasbeeky@gmail.com,04/04/2019,F,63,150,22,31,26.6,32,5lbs->Gain Muscle->April 4th 2020,19-15lbs->Lose Weight->April 4th 2020,->Increase Confidence->April 4th 2020,->Increase Energy->April 4th 2020,->->,->->,->->,->->,->->,
2019-04-05 14:36:15,1,Joseph,Kimball,,,,0,0,MICHAEL,TIMSON,(732) 745-2256,michael.timson13@yahoo.com,04/05/2019,Male,0,149,0,0,,28,->->,->->,->->,->->,->->,->->,->->,->->,->->,
2019-04-05 12:04:51,2,Dominique,Cruz,,,,,,MICHAEL,SOARES,(732) 789-2910,msoares7689@gmail.com,04/04/2019,Male,0,257,0,0,,34,->->,->->,->->,->->,->->,->->,->->,->->,->->,
2019-04-05 13:45:13,2,Dominique,Cruz,,,,,,MELISSA,BOPP,(732) 995-9788,mkbopp@gmail.com,04/05/2019,F,61,120,44,0,,30,-5->Lose Weight->April 5th 2020, 10->Gain Muscle->April 5th 2020, 5. 25-28%->Lose Inches->June 1st 2019,->Stress Relief->April 5th 2020,->Feel and Look Better->April 5th 2020,routine down in the gym->Other->October 1st 2019,->->,->->,->->,
2019-04-05 14:03:31,2,Dominique,Cruz,,,,,,YESSENIA,GALVAN,(732) 861-3922,ygalvan61@icloud.com,04/05/2019,Female,0,108,0,0,,28,->->,->->,->->,->->,->->,->->,->->,->->,->->,
2019-04-05 14:09:07,2,Dominique,Cruz,,,,,,MELISSA,BOPP,(732) 995-9788,mkbopp@gmail.com,04/05/2019,F,61,120,44,0,,30,-5->Lose Weight->April 5th 2020,10->Gain Muscle->April 5th 2020,5. 25-28%->Lose Inches->June 1st 2019,->Stress Relief->April 5th 2020,->Feel and Look Better->April 5th 2020,routine down in the gym->Other->October 1st 2019,->->,->->,->->,
2019-04-05 14:16:13,2,Dominique,Cruz,,,,0,0,MELISSA,BOPP,(732) 995-9788,mkbopp@gmail.com,04/05/2019,F,61,120,44,0,,30,-5->Lose Weight->April 5th 2020,10->Gain Muscle->April 5th 2020,5. 25-28%->Lose Inches->June 1st 2019,->Stress Relief->April 5th 2020,->Feel and Look Better->April 5th 2020,routine down in the gym->Other->October 1st 2019,->->,->->,->->,
2019-04-05 13:52:32,6,Veron,Thornhill,,,,49.99,399.92,brianna,augustin,7323376266,brilynnbrito@gmail.com,04/05/2019,F,61,195,23,35,36.9,40,20 lbs->Lose Weight->April 5th 2020,10 lb->Gain Muscle->April 5th 2020,ASAP->Stress Relief->April 5th 2020,->->,->->,->->,->->,->->,->->,
2019-04-05 15:05:50,8,Anthony,Cimini,,,,,,KELCY,KRETCHMER,(609) 802-5999,kelcykretchmer@yahoo.com,04/05/2019,F,66,146,24,39,23.6,26,->Lose Weight->April 5th 2020,->Gain Muscle->April 5th 2020,->Feel and Look Better->April 5th 2020,->Increase Confidence->April 5th 2020,->Lose Inches->April 5th 2020,->Better Health->April 5th 2020,->Increase Energy->April 5th 2020,->Stress Relief->April 5th 2020,->->,
2019-04-05 14:38:49,10,Patrick,Raymond,,,,0,0,TATUM,PETRUZZIELLO,(908) 635-4731,tatumpetro@gmail.com,04/05/2019,F,66,170,30,38,27.5,34,->->,->->,->->,->->,->->,->->,->->,->->,->->,
2019-04-05 13:48:57,11,Andrew,Addison,,,,,,FRANK JR,DIANGELIS,(732) 431-2932,dangles32@gmail.com,04/04/2019,F,63,258,18,31,45.8,38,->Gain Muscle->April 4th 2020,fat cells shrunken->Lose Weight->April 4th 2020,->Stress Relief->April 4th 2020,->Increase Confidence->April 4th 2020,->Feel and Look Better->April 4th 2020,->->,->->,->->,->->,
2019-04-05 16:36:23,11,Brian,Allen,,,,0,0,Christine,Korkowski,732-672-0843,tina1blaise@optonline.net,04/05/2019,F,64,119,49,52,20.5,22,10->Lose Weight->April 5th 2020,10->Gain Muscle->April 5th 2020,->->,->->,->->,->->,->->,->->,->->,
