  Event Time ,ClubID ,EmpFirstName ,EmpLastName ,Enrollment ,MonthlyDues ,PTSessions ,PTRate ,PTPrice ,FirstName ,LastName ,PhoneHome ,Email ,Date ,Gender ,Height ,Weight ,Age ,HealthAge ,BMI ,BodyFat ,Goal1 ->Objective1 ->Frame1 ,Goal2 ->Objective2 ->Frame2 ,Goal3 ->Objective3 ->Frame3 ,Goal4 ->Objective4 ->Frame4 ,Goal5 ->Objective5 ->Frame5 ,Goal6 ->Objective6 ->Frame6 ,Goal7 ->Objective7 ->Frame7 ,Goal8 ->Objective8 ->Frame8 ,Goal9 ->Objective9 ->Frame9 ,
2019-04-26 12:27:18,1,Joseph,Kimball,,,,0,0,KAITLYN,MAZZEO,(732) 501-4958,kaitlynmazzeo93@gmail.com,04/25/2019,F,64,196,25,45,33.7,41,->->,->->,->->,->->,->->,->->,->->,->->,->->,
2019-04-26 15:13:12,2,Dominique,Cruz,,,,0,0,EMMA,SMITH,(732) 580-5925,emmma821@yahoo.com,04/26/2019,Female,0,171,0,0,,29,->->,->->,->->,->->,->->,->->,->->,->->,->->,
2019-04-26 16:15:33,4,Samuel,Ramos,,,,0,0,DEBORAH,FARRELL,(732) 673-7021,Sunshine71671@aol.com,04/26/2019,F,60,128,48,53,25.0,36,lose 10lbs->Lose Weight->April 26th 2020,gain 10lbs of lean muscle->Gain Muscle->April 26th 2020,asap->Feel and Look Better->April 26th 2020,asap->Increase Confidence->April 26th 2020,->->,->->,->->,->->,->->,
2019-04-26 14:12:31,6,Veron,Thornhill,,,,46.66,279.96,Roberto,Bel,(347) 213-0718,roberto_bel1@yahoo.com,04/26/2019,M,75,206,46,52,25.8,17,10 lbs->Gain Muscle->April 26th 2020,educated on movements->Other->April 26th 2020,->->,->->,->->,->->,->->,->->,->->,
2019-04-26 12:08:27,7,ABCTEST,ABCTEST,,,,0,0,melquan,reevey,(732) 997-9654,mahahsahsai,03/02/2019,F,66,170,22,0,,31,->->,->->,->->,->->,->->,->->,->->,->->,->->,
2019-04-26 21:38:11,7,ABCTEST,ABCTEST,,,,0,0,melquan,reevey,(732) 997-9654,mahahsahsai,03/02/2019,F,66,170,22,0,,31,->->,->->,->->,->->,->->,->->,->->,->->,->->,
2019-04-26 14:56:32,8,Anthony,Cimini,,,,,,CHELSEA,NEEDHAM,(267) 309-7342,chelsealneedham@gmail.com,04/26/2019,F,66,168,26,34,27.2,31,->Lose Weight->April 26th 2020,->Feel and Look Better->April 26th 2020,->Better Health->April 26th 2020,->Lose Inches->April 26th 2020,->->,->->,->->,->->,->->,
2019-04-26 14:37:06,9,Anthony,Iazzetta,,,,0,0,ERIC,TLAXCANTITLA,732) 647-6753,eriktlax@gmail.com,04/26/2019,,0,0,0,0,,0,Gain 5-10 pounds->Gain Muscle->April 26th 2020,Lose 10-20->Lose Weight->April 26th 2020,Overall->Better Health->April 26th 2020,->->,->->,->->,->->,->->,->->,
2019-04-26 12:55:44,11,Brian,Allen,,,,0,0,Tammy,SCHROEDER,3447-323-1296,tschroed73@yahoo.com,04/26/2019,F,66,164,45,57,26.5,35,24->Lose Weight->April 26th 2020,10->Gain Muscle->April 26th 2020,->Better Health->April 26th 2020,->Feel and Look Better->April 26th 2020,->Increase Energy->April 26th 2020,->Stress Relief->April 26th 2020,->Increase Confidence->April 26th 2020,->Lose Inches->April 26th 2020,->->,
