  Event Time ,ClubID ,EmpFirstName ,EmpLastName ,Enrollment ,MonthlyDues ,PTSessions ,PTRate ,PTPrice ,FirstName ,LastName ,PhoneHome ,Email ,Date ,Gender ,Height ,Weight ,Age ,HealthAge ,BMI ,BodyFat ,Goal1 ->Objective1 ->Frame1 ,Goal2 ->Objective2 ->Frame2 ,Goal3 ->Objective3 ->Frame3 ,Goal4 ->Objective4 ->Frame4 ,Goal5 ->Objective5 ->Frame5 ,Goal6 ->Objective6 ->Frame6 ,Goal7 ->Objective7 ->Frame7 ,Goal8 ->Objective8 ->Frame8 ,Goal9 ->Objective9 ->Frame9 ,
2019-01-12 13:10:52,1,Joseph,Kimball,,,,,,RACHEL,CORDASCO,(732) 947-2858,rcordasco96@gmail.com,01/10/2019,F,62,122,25,28,22.4,21,->Gain Muscle->January 10th 2020,strength and speed->Other->January 10th 2020,->Better Health->January 10th 2020,->Increase Confidence->January 10th 2020,->->,->->,->->,->->,->->,
2019-01-12 15:17:38,1,Joseph,Kimball,,,,0,0,SANDRA,CANAS,(201) 401-3192,sandrah007@hotmail.com,01/12/2019,F,66,171,41,53,27.7,34,->->,->->,->->,->->,->->,->->,->->,->->,->->,
2019-01-12 16:50:54,1,Joseph,Kimball,,,,0,0,ARIELLE,DIAZ,(609) 955-0864,ariellediaz321@gmail.com,01/12/2019,F,66,156,28,43,25.2,34,->->,->->,->->,->->,->->,->->,->->,->->,->->,
2019-01-12 14:36:08,4,Samuel,Ramos,,,,,,BARBARA,SALVADORE,(732) 687-9014,barbaralbi73@gmail.com,01/12/2019,,0,146,0,0,,30,->->,->->,->->,->->,->->,->->,->->,->->,->->,
2019-01-12 15:58:07,6,Veron,Thornhill,,,,49.99,399.92,CONNIE,SMITH,(732) 685-7132,cosmi.6683@yahoo.com,01/12/2019,F,66,171,61,72,27.7,41,->->,->->,->->,->->,->->,->->,->->,->->,->->,
2019-01-12 17:15:42,6,Veron,Thornhill,,,,79.99,79.99,SAMANTHA,WHELAN,(908) 907-6724,samantha.hennin@me.com,01/12/2019,F,66,234,34,41,37.8,42,80 lbs->Lose Weight->January 12th 2020,10 lbs->Gain Muscle->January 12th 2020,ASAP->Better Health->January 12th 2020,->->,->->,->->,->->,->->,->->,
2019-01-12 17:36:10,6,Veron,Thornhill,,,,0,0,Tara,Carroll,(908) 310-5886,nyyankkefan@aol.com,01/12/2019,F,66,140,25,29,22.6,16,10 lbs->Lose Weight->January 12th 2020,10p->Gain Muscle->January 12th 2020,Forever->Better Health->January 12th 2020,->->,->->,->->,->->,->->,->->,
2019-01-12 18:57:17,6,Veron,Thornhill,,,,49.99,399.92,NICOLE,DORRITY,(732) 423-1384,nicoledorrity74@gmail.com,01/12/2019,F,66,160,44,49,25.9,16,->->,->->,->->,->->,->->,->->,->->,->->,->->,
2019-01-12 17:15:01,8,James,Goetz,,,,,,Christina,Benitez,609) 903-1942,jollyfan@gmail.com,01/12/2019,F,66,170,29,37,27.5,32,->->,->->,->->,->->,->->,->->,->->,->->,->->,
2019-01-12 17:00:22,9,Theresa,Burdge,,,,0,0,BARBARA,HICKOK,(732) 779-4253,bhickok@optoline.net,01/12/2019,F,63,210,54,64,37.3,47,->->,->->,->->,->->,->->,->->,->->,->->,->->,
2019-01-12 15:59:15,11,Brian,Allen,,,,0,0,Marina,Soloveychik,732-491-1432,marinas69@yahoo.com,01/12/2019,F,64,187,49,72,32.2,39,30->Lose Weight->January 12th 2020,10->Gain Muscle->January 12th 2020,->->,->->,->->,->->,->->,->->,->->,
2019-01-12 16:59:22,11,Brian,Allen,,,,0,0,Bernard,Holeman,732-972-2291,allencco@gmail.com,01/12/2019,M,68,223,70,82,34.0,37,38->Lose Weight->January 12th 2020,10->Gain Muscle->January 12th 2020,->->,->->,->->,->->,->->,->->,->->,
2019-01-12 19:56:03,11,Andrew,Addison,,,,,,Madison,Feldman,(732) 683-0717,madisonfeldman4@gmail.com,01/12/2019,Female,0,0,0,0,,0,->->,->->,->->,->->,->->,->->,->->,->->,->->,
2019-01-12 15:58:03,12,ABCTEST,ABCTEST,,,,0,0,Test,Test,(908) 692-1656,testtest@aol.com,12/06/2018,F,64,160,22,36,27.5,25,->Lose Weight->December 6th 2019,->Feel and Look Better->December 6th 2019,->Better Health->December 6th 2019,->Increase Confidence->December 6th 2019,->->,->->,->->,->->,->->,
2019-01-12 17:02:36,12,Nicolas,Longobardi,,,,52.49,419.92,ELIZABETH,TRINKLER,(732) 407-3943,lilbit92499@aol.com,01/12/2019,F,64,178,32,46,30.6,38,25lbs->Lose Weight->July 1st 2019,5lbs->Gain Muscle->January 12th 2020,asap->Feel and Look Better->January 12th 2020,asap->Increase Energy->January 12th 2020,->->,->->,->->,->->,->->,
