  Event Time ,ClubID ,EmpFirstName ,EmpLastName ,Enrollment ,MonthlyDues ,PTSessions ,PTRate ,PTPrice ,FirstName ,LastName ,PhoneHome ,Email ,Date ,Gender ,Height ,Weight ,Age ,HealthAge ,BMI ,BodyFat ,Goal1 ->Objective1 ->Frame1 ,Goal2 ->Objective2 ->Frame2 ,Goal3 ->Objective3 ->Frame3 ,Goal4 ->Objective4 ->Frame4 ,Goal5 ->Objective5 ->Frame5 ,Goal6 ->Objective6 ->Frame6 ,Goal7 ->Objective7 ->Frame7 ,Goal8 ->Objective8 ->Frame8 ,Goal9 ->Objective9 ->Frame9 ,
2019-01-25 14:25:06,1,Joseph,Kimball,,,,0,0,PUSHPA,PATHAK,(732) 710-8944,pushpa_pathak@hotmail.com,01/25/2019,F,62,135,64,73,24.7,44,->->,->->,->->,->->,->->,->->,->->,->->,->->,
2019-01-25 12:21:48,2,,,,,,0,0,DIANA,CACACE,,,05/23/2018,F,63,198,21,27,35.1,38,->->,->->,->->,->->,->->,->->,->->,->->,->->,
2019-01-25 16:06:26,2,Dominique,Cruz,,,,0,0,Hailey,Rock,2523053659,haileyrock21@gmail.com,01/25/2019,F,63,117,19,22,20.8,17, 10->Gain Muscle->January 25th 2020,->Feel and Look Better->January 25th 2020,->Stress Relief->January 25th 2020,->Increase Energy->January 25th 2020,->->,->->,->->,->->,->->,
2019-01-25 20:08:58,3,David,Hancock,,,,,,BARBARA,HENRIQUEZ,(732) 979-3505,barbara.henriquez28@hotmail.com,01/23/2019,F,66,334,28,42,54.0,64,->Lose Weight->January 23rd 2020,->Gain Muscle->January 23rd 2020,->Feel and Look Better->January 23rd 2020,->Increase Confidence->January 23rd 2020,->->,->->,->->,->->,->->,
2019-01-25 17:59:05,6,Theresa,Coccia,,,,0,0,TIM,ALBERT,(908) 251-7112,talbert85@gmail.com,01/25/2019,M,68,181,26,46,27.6,22,->Lose Weight->January 25th 2020,10lbs->Gain Muscle->January 25th 2020,cut body fat/srength->Other->January 25th 2020,->->,->->,->->,->->,->->,->->,
2019-01-25 13:57:10,11,Andrew,Addison,,,,,,Nina,Millan,7325555555,ninamilan@gmail.com,01/24/2019,,0,118,0,0,,32,->->,->->,->->,->->,->->,->->,->->,->->,->->,
2019-01-25 15:00:13,11,Brian,Allen,,,,0,0,Marissa,Leonlewandowski,908-216-2234,lewandowskimarissa@gmail.com,01/25/2019,F,60,130,19,24,25.4,25,10->Lose Weight->January 25th 2020,10->Gain Muscle->January 25th 2020,->Feel and Look Better->January 25th 2020,->Increase Confidence->January 25th 2020,->Better Health->January 25th 2020,->Increase Energy->January 25th 2020,->Stress Relief->January 25th 2020,->Lose Inches->January 25th 2020,->->,
2019-01-25 15:32:48,12,Nicolas,Longobardi,,,,59.99,119.98,AVERI,EGIERD,(609) 454-7395,averi.the.awesome@gmail.com,01/23/2019,F,64,120,14,12,20.6,44,5lbs->Gain Muscle->January 23rd 2020,asap->Better Health->January 23rd 2020,asap->Feel and Look Better->January 23rd 2020,->->,->->,->->,->->,->->,->->,
