  Event Time ,ClubID ,EmpFirstName ,EmpLastName ,Enrollment ,MonthlyDues ,PTSessions ,PTRate ,PTPrice ,FirstName ,LastName ,PhoneHome ,Email ,Date ,Gender ,Height ,Weight ,Age ,HealthAge ,BMI ,BodyFat ,Goal1 ->Objective1 ->Frame1 ,Goal2 ->Objective2 ->Frame2 ,Goal3 ->Objective3 ->Frame3 ,Goal4 ->Objective4 ->Frame4 ,Goal5 ->Objective5 ->Frame5 ,Goal6 ->Objective6 ->Frame6 ,Goal7 ->Objective7 ->Frame7 ,Goal8 ->Objective8 ->Frame8 ,Goal9 ->Objective9 ->Frame9 ,
2019-05-31 12:21:53,1,Joseph,Kimball,,,,,,ANGELA,HILSE,(732) 763-4914,Ahilse74@yahoo.com,05/29/2019,Female,0,141,0,0,,31,->->,->->,->->,->->,->->,->->,->->,->->,->->,
2019-05-31 14:40:29,1,Joseph,Kimball,,,,0,0,ADAM,CHIN,(732) 589-6371,adamchin1@yahoo.com,05/31/2019,M,70,200,21,30,28.8,25,5-10lbs->Gain Muscle->May 31st 2020,15-20lbs->Lose Weight->May 31st 2020,->Increase Confidence->May 31st 2020,->Increase Energy->May 31st 2020,->->,->->,->->,->->,->->,
2019-05-31 18:51:08,1,Joseph,Kimball,,,,,,BRIGITA,ARLAUSKAITE,(201) 892-1516,arlauskaitebrigita@gmail.com,05/31/2019,Female,0,175,0,0,,34,->->,->->,->->,->->,->->,->->,->->,->->,->->,
2019-05-31 21:20:22,3,David,Hancock,,,,40,160,HANNAH,HARKAY,(732) 675-8644,hharkay@gmail.com,05/31/2019,F,66,159,22,28,25.7,26,35LBS OF FAT LOSS->Lose Weight->May 31st 2020,->Gain Muscle->May 31st 2020,->Feel and Look Better->May 31st 2020,->->,->->,->->,->->,->->,->->,
2019-05-31 14:10:48,4,Samuel,Ramos,,,,0,0,Samuel,Ramos,4138837031,sramos@jerseystrong.com,04/03/2018,M,75,215,31,39,26.9,19,->->,->->,->->,->->,->->,->->,->->,->->,->->,
2019-05-31 22:18:00,4,Samuel,Ramos,,,,,,JASTI,SHRAVYA,(732) 856-3942,sxj517@miami.edu,05/31/2019,F,63,123,19,22,21.8,20,gain 10lbs of lean muscle->Gain Muscle->May 31st 2020,->->,->->,->->,->->,->->,->->,->->,->->,
2019-05-31 14:54:06,6,Veron,Thornhill,,,,40,640,TERRITO,STEWARD,(732) 791-3193,territosteward@yahoo.com,05/31/2019,M,67,307,47,55,48.2,38,56 lbs->Lose Weight->May 31st 2020,10 lbs->Gain Muscle->May 31st 2020,ASAP->Better Health->May 31st 2020,->->,->->,->->,->->,->->,->->,
2019-05-31 12:54:54,8,Anthony,Cimini,,,,,,GINA,DEMILT,(609) 610-0735,gdemilt@gmail.com,05/31/2019,F,63,125,22,28,22.2,16,->->,->->,->->,->->,->->,->->,->->,->->,->->,
2019-05-31 14:00:12,11,Brian,Allen,,,,0,0,Rachel,Lamb,908-872-2027,rlamb923@gmail.com,05/31/2019,F,66,155,27,32,25.1,25,10->Lose Weight->May 31st 2020,10->Gain Muscle->May 31st 2020,->->,->->,->->,->->,->->,->->,->->,
2019-05-31 15:07:58,11,Brian,Allen,,,,0,0,Laimute,Aravi,732-322-1714,laimutearavi@gmail.com,05/31/2019,F,63,163,58,67,28.9,38,25->Lose Weight->May 31st 2020,10->Gain Muscle->May 31st 2020,->Feel and Look Better->May 31st 2020,->Increase Energy->May 31st 2020,->Stress Relief->May 31st 2020,->Better Health->May 31st 2020,->Increase Confidence->May 31st 2020,stomach->Lose Inches->May 31st 2020,->->,
2019-05-31 16:47:15,11,Brian,Allen,,,,0,0,Timothy,Weisel,732-703-0492,weisel.us@gmail.com,05/31/2019,M,67,113,18,21,17.7,11,->Gain Muscle->May 31st 2020,->->,->->,->->,->->,->->,->->,->->,->->,
2019-05-31 22:02:57,11,Brian,Allen,,,,0,0,Valentina,Lafranca,732-770-6925,macellarolvalentina@gmail.com,05/31/2019,F,64,117,18,21,20.1,21,10->Gain Muscle->May 31st 2020,->->,->->,->->,->->,->->,->->,->->,->->,
2019-05-31 14:36:12,12,Nicolas,Longobardi,,,,45,90,JASON,SINGER,(973) 462-9096,jsinger@macrosoftinc.com,05/31/2019,M,72,185,52,57,25.1,23,5-10->Lose Weight->May 31st 2020,5->Gain Muscle->May 31st 2020,asap->Feel and Look Better->May 31st 2020,asap->Better Health->May 31st 2020,->->,->->,->->,->->,->->,
