ID,LastName,FirstName,PhoneHome,Email,RefFirst1,RefLast1,RefPhone1,RefEmail1,RefFirst2,RefLast2,RefPhone2,RefEmail2,RefFirst3,RefLast3,RefPhone3,RefEmail3,RefFirst4,RefLast4,RefPhone4,RefEmail4,RefFirst5,RefLast5,RefPhone5,RefEmail5,ClubID,
5775036,Burdick,cindy,(608) 921-9303,noemail@noemail.com,,,,,,,,,,,,,,,,,,,,,1,
6012554,Churchill,Chuck,(608) 751-8429,ckchurchill@aol.com,0269501,0269501,0269501,0269501,0269501,0269501,0269501,0269501,0269501,0269501,0269501,0269501,0269501,0269501,0269501,0269501,0269501,0269501,0269501,0269501,1,
6012546,Churchill,Kim,(608) 921-0004,ckchurchill@aol.com,0269500,0269500,0269500,0269500,0269500,0269500,0269500,0269500,0269500,0269500,0269500,0269500,0269500,0269500,0269500,0269500,0269500,0269500,0269500,0269500,1,
6002867,Dewey,Shelby,(608) 201-0057,shelby.dewey.90@gmail.com,0269464,0269464,0269464,0269464,0269464,0269464,0269464,0269464,0269464,0269464,0269464,0269464,0269464,0269464,0269464,0269464,0269464,0269464,0269464,0269464,1,
5796364,Gackstatter,Janna,(608) 289-0576,jannax4@yahoo.com,,,,,,,,,,,,,,,,,,,,,1,
5953585,Hahn,Derek,(608) 449-3045,derek.hahn@wellsfargoadvisories.com,0269265,0269265,0269265,0269265,0269265,0269265,0269265,0269265,0269265,0269265,0269265,0269265,0269265,0269265,0269265,0269265,0269265,0269265,0269265,0269265,1,
6001686,Kraemer,Priscilla,(608) 359-5422,Kraemer17@live.com,0269457,0269457,0269457,0269457,0269457,0269457,0269457,0269457,0269457,0269457,0269457,0269457,0269457,0269457,0269457,0269457,0269457,0269457,0269457,0269457,1,
6007188,Krueger,Riana,(608) 774-8212,emeline1123@gmail.com,0269488,0269488,0269488,0269488,0269488,0269488,0269488,0269488,0269488,0269488,0269488,0269488,0269488,0269488,0269488,0269488,0269488,0269488,0269488,0269488,1,
5734206,Krueger,Riley,(608) 516-5312,krueger.4225@gmail.com,,,,,,,,,,,,,,,,,,,,,1,
6009193,Michaelson,Kayla,(608) 302-7677,michaelson.k99@gmail.com,3214640,3214640,3214640,3214640,3214640,3214640,3214640,3214640,3214640,3214640,3214640,3214640,3214640,3214640,3214640,3214640,3214640,3214640,3214640,3214640,1,
6001505,Mikkelson,Bria,(608) 322-9468,briamikkelson@gmail.com,0269455,0269455,0269455,0269455,0269455,0269455,0269455,0269455,0269455,0269455,0269455,0269455,0269455,0269455,0269455,0269455,0269455,0269455,0269455,0269455,1,
5902786,Pastorius,Karen,(608) 359-4232,tpastbuilders@gmail.com,,,,,,,,,,,,,,,,,,,,,1,
6007428,Shelby,Dewey,(608) 201-0057,shelby.dewey.90@gmail.com,0269491,0269491,0269491,0269491,0269491,0269491,0269491,0269491,0269491,0269491,0269491,0269491,0269491,0269491,0269491,0269491,0269491,0269491,0269491,0269491,1,
5996226,draves,wendy,(608) 921-6998,draves1996@gmail.com,3214623,3214623,3214623,3214623,3214623,3214623,3214623,3214623,3214623,3214623,3214623,3214623,3214623,3214623,3214623,3214623,3214623,3214623,3214623,3214623,1,
5805073,gottschalk,kilah,(608) 931-9763,gottschakm03@uww.edu,,,,,,,,,,,,,,,,,,,,,1,
