ID,LastName,FirstName,PhoneHome,Email,RefFirst1,RefLast1,RefPhone1,RefEmail1,RefFirst2,RefLast2,RefPhone2,RefEmail2,RefFirst3,RefLast3,RefPhone3,RefEmail3,RefFirst4,RefLast4,RefPhone4,RefEmail4,RefFirst5,RefLast5,RefPhone5,RefEmail5,ClubID,
6160818,,,,,,,,,,,,,,,,,,,,,,,,,1,
6164876,Arndt,Katie,(608) 290-7088,katiearndt33@gmail.com,,,,,,,,,,,,,,,,,,,,,1,
6161910,Banda,Daniel,(608) 436-4364,dfbanda21@gmail.com,,,,,,,,,,,,,,,,,,,,,1,
6161199,Berg,Chelsea,(608) 931-3798,cberg402000@yahoo.com,0291547,0291547,0291547,0291547,0291547,0291547,0291547,0291547,0291547,0291547,0291547,0291547,0291547,0291547,0291547,0291547,0291547,0291547,0291547,0291547,1,
6092974,Bier,Arleen,(608) 295-9503,biergirl16@gmail.com,0269869,0269869,0269869,0269869,0269869,0269869,0269869,0269869,0269869,0269869,0269869,0269869,0269869,0269869,0269869,0269869,0269869,0269869,0269869,0269869,1,
6158129,Buggs,Alyssa,(608) 346-4850,acbuggs98@gmail.com,3214053,3214053,3214053,3214053,3214053,3214053,3214053,3214053,3214053,3214053,3214053,3214053,3214053,3214053,3214053,3214053,3214053,3214053,3214053,3214053,1,
6161079,Cass,Amanda,(608) 921-4080,dano91181@gmail.com,,,,,,,,,,,,,,,,,,,,,1,
6162192,Covert,Jake,(608) 728-4231,noemail@aol.com,,,,,,,,,,,,,,,,,,,,,1,
6158133,Cuevas,Julianna,(608) 436-2558,juliannacuevas26@gmail.com,3214054,3214054,3214054,3214054,3214054,3214054,3214054,3214054,3214054,3214054,3214054,3214054,3214054,3214054,3214054,3214054,3214054,3214054,3214054,3214054,1,
6120137,Cummings,Kathleen,(405) 514-9487,kcummings1920@gmail.com+,3214960,3214960,3214960,3214960,3214960,3214960,3214960,3214960,3214960,3214960,3214960,3214960,3214960,3214960,3214960,3214960,3214960,3214960,3214960,3214960,1,
6160582,Dickinson,Jeremy,(262) 232-3813,jeremydickinson9374@gmail.com,,,,,,,,,,,,,,,,,,,,,1,
6165011,Dunlap,Cenithia,(608) 515-7417,nithidunlap@gmail.com,,,,,,,,,,,,,,,,,,,,,1,
6165013,Dunlap,Cenithia,(608) 515-7417,nithidunlap@gmail.com,,,,,,,,,,,,,,,,,,,,,1,
5796364,Gackstatter,Janna,(608) 289-0576,jannax4@yahoo.com,,,,,,,,,,,,,,,,,,,,,1,
6156226,Greb,Fred,(423) 519-8344,fredgreb@msn.com,,,,,,,,,,,,,,,,,,,,,1,
6159855,Hahn,Earaina,(717) 683-5267,earaina@att.net,,,,,,,,,,,,,,,,,,,,,1,
6161905,Jones,Sal,(414) 248-1906,rasuljones7414@gmail.com,,,,,,,,,,,,,,,,,,,,,1,
6163366,Jones,Tabatha,(608) 371-3568,tab.jones10174@gmail.com,3214080,3214080,3214080,3214080,3214080,3214080,3214080,3214080,3214080,3214080,3214080,3214080,3214080,3214080,3214080,3214080,3214080,3214080,3214080,3214080,1,
6162367,Knight,Gloria,(608) 512-3694,knightgloria87@gmail.com,,,,,,,,,,,,,,,,,,,,,1,
6162410,Kreger,Ryan,(608) 247-9650,hotrodman29@yahoo.com,,,,,,,,,,,,,,,,,,,,,1,
6163663,Ladd,Diane,(608) 436-1893,dianeladd11651@gmail.com,0269266,0269266,0269266,0269266,0269266,0269266,0269266,0269266,0269266,0269266,0269266,0269266,0269266,0269266,0269266,0269266,0269266,0269266,0269266,0269266,1,
6164465,Laue,Brandon,(308) 293-0585,laued30@gmail.com,,,,,,,,,,,,,,,,,,,,,1,
6143880,Miller,Heather,(608) 449-8568,noemail@charter.net,3214891,3214891,3214891,3214891,3214891,3214891,3214891,3214891,3214891,3214891,3214891,3214891,3214891,3214891,3214891,3214891,3214891,3214891,3214891,3214891,1,
6164374,Morris,Tina,(815) 558-6241,tinamarie7272@yahoo.com,,,,,,,,,,,,,,,,,,,,,1,
6120648,Mundt,Jessica,(608) 205-7856,jessica.mundt@yahoo.com,0269037,0269037,0269037,0269037,0269037,0269037,0269037,0269037,0269037,0269037,0269037,0269037,0269037,0269037,0269037,0269037,0269037,0269037,0269037,0269037,1,
6156360,Notprovided,Matt,(608) 473-4898,,,,,,,,,,,,,,,,,,,,,,1,
5702298,Pekul,Jason,(920) 206-5565,jtpekul@att.net,,,,,,,,,,,,,,,,,,,,,1,
6159997,Perez,Holly,(608) 312-5576,hollynperez@gmail.com,,,,,,,,,,,,,,,,,,,,,1,
6158318,Peterson,Amanda,(608) 322-6197,luvmybaby11@gmail.com,,,,,,,,,,,,,,,,,,,,,1,
6086866,Peterson,Ethan,(608) 322-6197,luvmybaby11@gmail.com,0269838,0269838,0269838,0269838,0269838,0269838,0269838,0269838,0269838,0269838,0269838,0269838,0269838,0269838,0269838,0269838,0269838,0269838,0269838,0269838,1,
6120304,Rios,Steven,(608) 354-3039,noemail@yahoo.com,0269035,0269035,0269035,0269035,0269035,0269035,0269035,0269035,0269035,0269035,0269035,0269035,0269035,0269035,0269035,0269035,0269035,0269035,0269035,0269035,1,
6117361,Sampe,Jacob,(507) 236-5057,jacob.sampe@alum.blc.edu,0291501,0291501,0291501,0291501,0291501,0291501,0291501,0291501,0291501,0291501,0291501,0291501,0291501,0291501,0291501,0291501,0291501,0291501,0291501,0291501,1,
6159671,Sbonik,Jessica,(608) 290-3632,jsbonik2@gmail.com,0269248,0269248,0269248,0269248,0269248,0269248,0269248,0269248,0269248,0269248,0269248,0269248,0269248,0269248,0269248,0269248,0269248,0269248,0269248,0269248,1,
6156460,Schnicke,Joe,(608) 554-5278,joseph.schnicke@yahoo.com,3214048,3214048,3214048,3214048,3214048,3214048,3214048,3214048,3214048,3214048,3214048,3214048,3214048,3214048,3214048,3214048,3214048,3214048,3214048,3214048,1,
6167689,Smith,Guy,(608) 750-1000,aeiousious@gmail.com,0269283,0269283,0269283,0269283,0269283,0269283,0269283,0269283,0269283,0269283,0269283,0269283,0269283,0269283,0269283,0269283,0269283,0269283,0269283,0269283,1,
6120408,Smith,Josh,(608) 371-4964,joshuasmith8477@gmail.com+,3214972,3214972,3214972,3214972,3214972,3214972,3214972,3214972,3214972,3214972,3214972,3214972,3214972,3214972,3214972,3214972,3214972,3214972,3214972,3214972,1,
6156470,Smith-Schnicke,Sherry,(513) 374-4635,catrra@gmail.com,3214049,3214049,3214049,3214049,3214049,3214049,3214049,3214049,3214049,3214049,3214049,3214049,3214049,3214049,3214049,3214049,3214049,3214049,3214049,3214049,1,
6164172,Thomsen,Brenda,(715) 520-0967,brendathomsen1019@gmail.com,0269267,0269267,0269267,0269267,0269267,0269267,0269267,0269267,0269267,0269267,0269267,0269267,0269267,0269267,0269267,0269267,0269267,0269267,0269267,0269267,1,
6158328,Twardzik,Melissa,(608) 800-1231,melissatwardzik12@gmail.com+,3214062,3214062,3214062,3214062,3214062,3214062,3214062,3214062,3214062,3214062,3214062,3214062,3214062,3214062,3214062,3214062,3214062,3214062,3214062,3214062,1,
6164576,Ward,Chelsea,(608) 346-5022,hockey.qusk6@gmail.com,,,,,,,,,,,,,,,,,,,,,1,
6162739,White,Dinah,(608) 449-0155,email@email.com,0269263,0269263,0269263,0269263,0269263,0269263,0269263,0269263,0269263,0269263,0269263,0269263,0269263,0269263,0269263,0269263,0269263,0269263,0269263,0269263,1,
6157713,White,dinah,(608) 449-0155,dinah1@charter.net,,,,,,,,,,,,,,,,,,,,,1,
6167072,Whiteaker,Tammy,(608) 290-7171,twhiteaker03@gmail.com,0269282,0269282,0269282,0269282,0269282,0269282,0269282,0269282,0269282,0269282,0269282,0269282,0269282,0269282,0269282,0269282,0269282,0269282,0269282,0269282,1,
6146031,burdick,cindy,(608) 921-9303,cboceanview@aol.com,0269181,0269181,0269181,0269181,0269181,0269181,0269181,0269181,0269181,0269181,0269181,0269181,0269181,0269181,0269181,0269181,0269181,0269181,0269181,0269181,1,
6161201,cass,amanda,(608) 921-4080,dano91181@gmail.com,0291548,0291548,0291548,0291548,0291548,0291548,0291548,0291548,0291548,0291548,0291548,0291548,0291548,0291548,0291548,0291548,0291548,0291548,0291548,0291548,1,
6156234,spencer,jeremy,(608) 999-9999,spencerjeremy78@icloud.com,0269232,0269232,0269232,0269232,0269232,0269232,0269232,0269232,0269232,0269232,0269232,0269232,0269232,0269232,0269232,0269232,0269232,0269232,0269232,0269232,1,
5692479,yao,channy,(608) 898-1055,channyyao24@yahoo.com,,,,,,,,,,,,,,,,,,,,,1,
