ID,LastName,FirstName,PhoneHome,Email,RefFirst1,RefLast1,RefPhone1,RefEmail1,RefFirst2,RefLast2,RefPhone2,RefEmail2,RefFirst3,RefLast3,RefPhone3,RefEmail3,RefFirst4,RefLast4,RefPhone4,RefEmail4,RefFirst5,RefLast5,RefPhone5,RefEmail5,ClubID,
6306930,Billot,Ryan,(262) 949-1984,viper092593@hotmail.com,,,,,,,,,,,,,,,,,,,,,1,
6671212,Briggs,Rachael,(608) 931-8105,rlbriggs0219@gmail.com,,,,,,,,,,,,,,,,,,,,,1,
6670416,Campbell,Jermey,(715) 538-5066,jermeycampbelljr@gmail.com+,3920653,3920653,3920653,3920653,3920653,3920653,3920653,3920653,3920653,3920653,3920653,3920653,3920653,3920653,3920653,3920653,3920653,3920653,3920653,3920653,1,
6665015,Carter,Alysha,(580) 713-8081,alyshacarter14@gmail.com,,,,,,,,,,,,,,,,,,,,,1,
6668844,Conroy,Bernadette,(262) 749-8141,conroy8815@yahoo.com,3920533,3920533,3920533,3920533,3920533,3920533,3920533,3920533,3920533,3920533,3920533,3920533,3920533,3920533,3920533,3920533,3920533,3920533,3920533,3920533,1,
6670936,Dominguez,Trevor,(608) 289-5193,ordominguez99@yahoo.com,,,,,,,,,,,,,,,,,,,,,1,
6668999,Dominquez,Trevor,(608) 921-9886,trevordominquez99@gmail.com,3920639,3920639,3920639,3920639,3920639,3920639,3920639,3920639,3920639,3920639,3920639,3920639,3920639,3920639,3920639,3920639,3920639,3920639,3920639,3920639,1,
6670829,Eaker,James,(608) 774-7429,jameseaker18@gmail.com,,,,,,,,,,,,,,,,,,,,,1,
6670508,Foss,Hailey,(608) 290-1902,Haileyfoss24@gmail.com,,,,,,,,,,,,,,,,,,,,,1,
6611411,Gackstatter,Janna,(608) 756-3737,dsfds@att.met,3920412,3920412,3920412,3920412,3920412,3920412,3920412,3920412,3920412,3920412,3920412,3920412,3920412,3920412,3920412,3920412,3920412,3920412,3920412,3920412,1,
6667828,Hernandez,Jesus,(608) 898-8293,bryanleon1330@gmail.com+,3920635,3920635,3920635,3920635,3920635,3920635,3920635,3920635,3920635,3920635,3920635,3920635,3920635,3920635,3920635,3920635,3920635,3920635,3920635,3920635,1,
6670196,Homan,Conner,(608) 247-2068,homan04@yahoo.com,3920645,3920645,3920645,3920645,3920645,3920645,3920645,3920645,3920645,3920645,3920645,3920645,3920645,3920645,3920645,3920645,3920645,3920645,3920645,3920645,1,
6624353,Hughes,Hannah,(608) 295-8123,hughes0925@gmail.com,,,,,,,,,,,,,,,,,,,,,1,
6671403,Lashley,Flo,(508) 415-4700,lashflo163@gmail.com,3920543,3920543,3920543,3920543,3920543,3920543,3920543,3920543,3920543,3920543,3920543,3920543,3920543,3920543,3920543,3920543,3920543,3920543,3920543,3920543,1,
6669001,Loveland,Wesley,(920) 221-8809,lovelandwesley@gmail.com,3920640,3920640,3920640,3920640,3920640,3920640,3920640,3920640,3920640,3920640,3920640,3920640,3920640,3920640,3920640,3920640,3920640,3920640,3920640,3920640,1,
6671834,Mcguire,Makia,(608) 322-4226,makia.mcguire@gmail.com,,,,,,,,,,,,,,,,,,,,,1,
6670753,Myre,Jack,(815) 514-7284,ghmyre@gmail.com,,,,,,,,,,,,,,,,,,,,,1,
6669678,Olgvin,Cesar,(608) 322-2192,cromanaaip@yahoo.com,,,,,,,,,,,,,,,,,,,,,1,
6671196,Oliveira,Leonardo,(815) 329-2540,lo.oliveiraa9@gmail.com,3920540,3920540,3920540,3920540,3920540,3920540,3920540,3920540,3920540,3920540,3920540,3920540,3920540,3920540,3920540,3920540,3920540,3920540,3920540,3920540,1,
6296778,Sanford,tam,(608) 756-5383,gtls@charter.net,,,,,,,,,,,,,,,,,,,,,1,
6656224,Simon,Cassidy,(608) 314-7433,simoncassidy@gmail.com,,,,,,,,,,,,,,,,,,,,,1,
6669620,Strzykowski,Cassandra,(608) 371-7733,c.j.strzy@gmail.com,,,,,,,,,,,,,,,,,,,,,1,
6667988,Sutherland,Tina,(715) 459-2202,tina.sutherland2013@gmail.com,,,,,,,,,,,,,,,,,,,,,1,
6670520,Wickersham,Ken,(608) 898-0943,wickersham69@gmail.com,3920657,3920657,3920657,3920657,3920657,3920657,3920657,3920657,3920657,3920657,3920657,3920657,3920657,3920657,3920657,3920657,3920657,3920657,3920657,3920657,1,
6671437,Wickersham,Tracy,(608) 898-0939,irishlassy08@gmail.com,3920662,3920662,3920662,3920662,3920662,3920662,3920662,3920662,3920662,3920662,3920662,3920662,3920662,3920662,3920662,3920662,3920662,3920662,3920662,3920662,1,
6670535,Worden,Shane,(608) 206-0941,shane.worden@yahoo.com,,,,,,,,,,,,,,,,,,,,,1,
6671323,lashley,kenrick,(617) 953-6619,klashley60@gmal.com,4981326,4981326,4981326,4981326,4981326,4981326,4981326,4981326,4981326,4981326,4981326,4981326,4981326,4981326,4981326,4981326,4981326,4981326,4981326,4981326,1,
6670396,powell,allie,(715) 530-0133,powellallie14@gmail.com,3920650,3920650,3920650,3920650,3920650,3920650,3920650,3920650,3920650,3920650,3920650,3920650,3920650,3920650,3920650,3920650,3920650,3920650,3920650,3920650,1,
